{"text_format":"3","workbook":"xlsx","n_sheets":4,"sheets":["Übersicht","Anmeldung Teilnehmer","Schützen_DB","Dropdown"],"not_rendered":{"images":1,"defined_names":10},"read":"whole","date_system":"1900"}

{"sheet":"Übersicht","index":0,"n_rows":22,"n_cols":2,"rows_kept":22,"merged":[[2,1,2,4],[21,0,24,5]]}
["Anmeldungen Kant. Cup AR 300m"]
[]
["Verein",{"$f":"IF('Anmeldung Teilnehmer'!B6=\"Hier Vereinsname auswählen\", \"Vor Teilnehmer erfassung, in Tabelle Anmeldung Teilnehmer zuerst Verein in Zelle B6 auswählen\",'Anmeldung Teilnehmer'!B6)","v":"Vor Teilnehmer erfassung, in Tabelle Anmeldung Teilnehmer zuerst Verein in Zelle B6 auswählen"}]
[]
["Anzahl Feld Sport (S)",{"$f":"ZaehlenFeld_S","v":0}]
["Anzahl Feld Ordonnanz (O)",{"$f":"ZaehlenFeld_O","v":0}]
["Anzahl Feld Jugend U21/U15 (J)",{"$f":"ZaehlenFeld_J","v":0}]
[]
[]
[]
["Total:",{"$f":"SUM(B5:B10)","v":0}]
[]
["Der Kant. Cup findet am"]
["2026-09-12"]
["in Herisau Säge statt."]
[]
["Die Anmeldungen sind bis 30.08. an folgende E-Mail-Adresse zu richten:"]
[]
["wettkaempfe@ksv-ar.ch"]
[]
[]
["Dem Angemeldeten Verein werden pro Teilnehmer CHF 20.00 auf der Jahresrechnung belastet. Abmeldungen können nicht berücksichtigt werden. Es kann jedoch ein anderes Mitglied aus dem Verein teilnehmen. Die Mutation ist schnellstmöglichst dem wettkaempfe@ksv-ar.ch zu melden."]

{"sheet":"Anmeldung Teilnehmer","index":1,"n_rows":50,"n_cols":5,"rows_kept":50,"merged":[[5,1,5,4],[6,0,6,4]]}
[null,{"$f":"Übersicht!A1","v":"Anmeldungen Kant. Cup AR 300m"}]
[]
[]
[]
[]
["Verein:","Hier Vereinsname auswählen"]
["ein Teilnehmer darf nur in einem Feld starten"]
["Feld","Lizenz-Nr","Name","Vorname","Jahrgang"]
[null,null,{"$f":"IF(Anmeldung[[#This Row],[Lizenz-Nr]]=\"\",\"\",IF(ISNA(VLOOKUP(Anmeldung[[#This Row],[Lizenz-Nr]],DB_Schützen[],Schützen_DB!$B$1,FALSE)),\"Teilnehmer\",VLOOKUP(Anmeldung[[#This Row],[Lizenz-Nr]],DB_Schützen[],Schützen_DB!$B$1,FALSE)))","v":""},{"$f":"IF(Anmeldung[[#This Row],[Lizenz-Nr]]=\"\",\"\",IF(ISNA(VLOOKUP(Anmeldung[[#This Row],[Lizenz-Nr]],DB_Schützen[],Schützen_DB!$C$1,FALSE)),\"nicht gefunden\",VLOOKUP(Anmeldung[[#This Row],[Lizenz-Nr]],DB_Schützen[],Schützen_DB!$C$1,FALSE)))","v":""},{"$f":"IF(Anmeldung[[#This Row],[Lizenz-Nr]]=\"\",\"\",IF(ISNA(VLOOKUP(Anmeldung[[#This Row],[Lizenz-Nr]],DB_Schützen[],Schützen_DB!$D$1,FALSE)),\"Lizenznummer prüfen oder Teilnhemer in Schützen_DB erfassen\",VLOOKUP(Anmeldung[[#This Row],[Lizenz-Nr]],DB_Schützen[],Schützen_DB!$D$1,FALSE)))","v":""}]
[null,null,{"$f":"IF(Anmeldung[[#This Row],[Lizenz-Nr]]=\"\",\"\",IF(ISNA(VLOOKUP(Anmeldung[[#This Row],[Lizenz-Nr]],DB_Schützen[],Schützen_DB!$B$1,FALSE)),\"Teilnehmer\",VLOOKUP(Anmeldung[[#This Row],[Lizenz-Nr]],DB_Schützen[],Schützen_DB!$B$1,FALSE)))","v":""},{"$f":"IF(Anmeldung[[#This Row],[Lizenz-Nr]]=\"\",\"\",IF(ISNA(VLOOKUP(Anmeldung[[#This Row],[Lizenz-Nr]],DB_Schützen[],Schützen_DB!$C$1,FALSE)),\"nicht gefunden\",VLOOKUP(Anmeldung[[#This Row],[Lizenz-Nr]],DB_Schützen[],Schützen_DB!$C$1,FALSE)))","v":""},{"$f":"IF(Anmeldung[[#This Row],[Lizenz-Nr]]=\"\",\"\",IF(ISNA(VLOOKUP(Anmeldung[[#This Row],[Lizenz-Nr]],DB_Schützen[],Schützen_DB!$D$1,FALSE)),\"Lizenznummer prüfen oder Teilnhemer in Schützen_DB erfassen\",VLOOKUP(Anmeldung[[#This Row],[Lizenz-Nr]],DB_Schützen[],Schützen_DB!$D$1,FALSE)))","v":""}]
[null,null,{"$f":"IF(Anmeldung[[#This Row],[Lizenz-Nr]]=\"\",\"\",IF(ISNA(VLOOKUP(Anmeldung[[#This Row],[Lizenz-Nr]],DB_Schützen[],Schützen_DB!$B$1,FALSE)),\"Teilnehmer\",VLOOKUP(Anmeldung[[#This Row],[Lizenz-Nr]],DB_Schützen[],Schützen_DB!$B$1,FALSE)))","v":""},{"$f":"IF(Anmeldung[[#This Row],[Lizenz-Nr]]=\"\",\"\",IF(ISNA(VLOOKUP(Anmeldung[[#This Row],[Lizenz-Nr]],DB_Schützen[],Schützen_DB!$C$1,FALSE)),\"nicht gefunden\",VLOOKUP(Anmeldung[[#This Row],[Lizenz-Nr]],DB_Schützen[],Schützen_DB!$C$1,FALSE)))","v":""},{"$f":"IF(Anmeldung[[#This Row],[Lizenz-Nr]]=\"\",\"\",IF(ISNA(VLOOKUP(Anmeldung[[#This Row],[Lizenz-Nr]],DB_Schützen[],Schützen_DB!$D$1,FALSE)),\"Lizenznummer prüfen oder Teilnhemer in Schützen_DB erfassen\",VLOOKUP(Anmeldung[[#This Row],[Lizenz-Nr]],DB_Schützen[],Schützen_DB!$D$1,FALSE)))","v":""}]
[null,null,{"$f":"IF(Anmeldung[[#This Row],[Lizenz-Nr]]=\"\",\"\",IF(ISNA(VLOOKUP(Anmeldung[[#This Row],[Lizenz-Nr]],DB_Schützen[],Schützen_DB!$B$1,FALSE)),\"Teilnehmer\",VLOOKUP(Anmeldung[[#This Row],[Lizenz-Nr]],DB_Schützen[],Schützen_DB!$B$1,FALSE)))","v":""},{"$f":"IF(Anmeldung[[#This Row],[Lizenz-Nr]]=\"\",\"\",IF(ISNA(VLOOKUP(Anmeldung[[#This Row],[Lizenz-Nr]],DB_Schützen[],Schützen_DB!$C$1,FALSE)),\"nicht gefunden\",VLOOKUP(Anmeldung[[#This Row],[Lizenz-Nr]],DB_Schützen[],Schützen_DB!$C$1,FALSE)))","v":""},{"$f":"IF(Anmeldung[[#This Row],[Lizenz-Nr]]=\"\",\"\",IF(ISNA(VLOOKUP(Anmeldung[[#This Row],[Lizenz-Nr]],DB_Schützen[],Schützen_DB!$D$1,FALSE)),\"Lizenznummer prüfen oder Teilnhemer in Schützen_DB erfassen\",VLOOKUP(Anmeldung[[#This Row],[Lizenz-Nr]],DB_Schützen[],Schützen_DB!$D$1,FALSE)))","v":""}]
[null,null,{"$f":"IF(Anmeldung[[#This Row],[Lizenz-Nr]]=\"\",\"\",IF(ISNA(VLOOKUP(Anmeldung[[#This Row],[Lizenz-Nr]],DB_Schützen[],Schützen_DB!$B$1,FALSE)),\"Teilnehmer\",VLOOKUP(Anmeldung[[#This Row],[Lizenz-Nr]],DB_Schützen[],Schützen_DB!$B$1,FALSE)))","v":""},{"$f":"IF(Anmeldung[[#This Row],[Lizenz-Nr]]=\"\",\"\",IF(ISNA(VLOOKUP(Anmeldung[[#This Row],[Lizenz-Nr]],DB_Schützen[],Schützen_DB!$C$1,FALSE)),\"nicht gefunden\",VLOOKUP(Anmeldung[[#This Row],[Lizenz-Nr]],DB_Schützen[],Schützen_DB!$C$1,FALSE)))","v":""},{"$f":"IF(Anmeldung[[#This Row],[Lizenz-Nr]]=\"\",\"\",IF(ISNA(VLOOKUP(Anmeldung[[#This Row],[Lizenz-Nr]],DB_Schützen[],Schützen_DB!$D$1,FALSE)),\"Lizenznummer prüfen oder Teilnhemer in Schützen_DB erfassen\",VLOOKUP(Anmeldung[[#This Row],[Lizenz-Nr]],DB_Schützen[],Schützen_DB!$D$1,FALSE)))","v":""}]
[null,null,{"$f":"IF(Anmeldung[[#This Row],[Lizenz-Nr]]=\"\",\"\",IF(ISNA(VLOOKUP(Anmeldung[[#This Row],[Lizenz-Nr]],DB_Schützen[],Schützen_DB!$B$1,FALSE)),\"Teilnehmer\",VLOOKUP(Anmeldung[[#This Row],[Lizenz-Nr]],DB_Schützen[],Schützen_DB!$B$1,FALSE)))","v":""},{"$f":"IF(Anmeldung[[#This Row],[Lizenz-Nr]]=\"\",\"\",IF(ISNA(VLOOKUP(Anmeldung[[#This Row],[Lizenz-Nr]],DB_Schützen[],Schützen_DB!$C$1,FALSE)),\"nicht gefunden\",VLOOKUP(Anmeldung[[#This Row],[Lizenz-Nr]],DB_Schützen[],Schützen_DB!$C$1,FALSE)))","v":""},{"$f":"IF(Anmeldung[[#This Row],[Lizenz-Nr]]=\"\",\"\",IF(ISNA(VLOOKUP(Anmeldung[[#This Row],[Lizenz-Nr]],DB_Schützen[],Schützen_DB!$D$1,FALSE)),\"Lizenznummer prüfen oder Teilnhemer in Schützen_DB erfassen\",VLOOKUP(Anmeldung[[#This Row],[Lizenz-Nr]],DB_Schützen[],Schützen_DB!$D$1,FALSE)))","v":""}]
[null,null,{"$f":"IF(Anmeldung[[#This Row],[Lizenz-Nr]]=\"\",\"\",IF(ISNA(VLOOKUP(Anmeldung[[#This Row],[Lizenz-Nr]],DB_Schützen[],Schützen_DB!$B$1,FALSE)),\"Teilnehmer\",VLOOKUP(Anmeldung[[#This Row],[Lizenz-Nr]],DB_Schützen[],Schützen_DB!$B$1,FALSE)))","v":""},{"$f":"IF(Anmeldung[[#This Row],[Lizenz-Nr]]=\"\",\"\",IF(ISNA(VLOOKUP(Anmeldung[[#This Row],[Lizenz-Nr]],DB_Schützen[],Schützen_DB!$C$1,FALSE)),\"nicht gefunden\",VLOOKUP(Anmeldung[[#This Row],[Lizenz-Nr]],DB_Schützen[],Schützen_DB!$C$1,FALSE)))","v":""},{"$f":"IF(Anmeldung[[#This Row],[Lizenz-Nr]]=\"\",\"\",IF(ISNA(VLOOKUP(Anmeldung[[#This Row],[Lizenz-Nr]],DB_Schützen[],Schützen_DB!$D$1,FALSE)),\"Lizenznummer prüfen oder Teilnhemer in Schützen_DB erfassen\",VLOOKUP(Anmeldung[[#This Row],[Lizenz-Nr]],DB_Schützen[],Schützen_DB!$D$1,FALSE)))","v":""}]
[null,null,{"$f":"IF(Anmeldung[[#This Row],[Lizenz-Nr]]=\"\",\"\",IF(ISNA(VLOOKUP(Anmeldung[[#This Row],[Lizenz-Nr]],DB_Schützen[],Schützen_DB!$B$1,FALSE)),\"Teilnehmer\",VLOOKUP(Anmeldung[[#This Row],[Lizenz-Nr]],DB_Schützen[],Schützen_DB!$B$1,FALSE)))","v":""},{"$f":"IF(Anmeldung[[#This Row],[Lizenz-Nr]]=\"\",\"\",IF(ISNA(VLOOKUP(Anmeldung[[#This Row],[Lizenz-Nr]],DB_Schützen[],Schützen_DB!$C$1,FALSE)),\"nicht gefunden\",VLOOKUP(Anmeldung[[#This Row],[Lizenz-Nr]],DB_Schützen[],Schützen_DB!$C$1,FALSE)))","v":""},{"$f":"IF(Anmeldung[[#This Row],[Lizenz-Nr]]=\"\",\"\",IF(ISNA(VLOOKUP(Anmeldung[[#This Row],[Lizenz-Nr]],DB_Schützen[],Schützen_DB!$D$1,FALSE)),\"Lizenznummer prüfen oder Teilnhemer in Schützen_DB erfassen\",VLOOKUP(Anmeldung[[#This Row],[Lizenz-Nr]],DB_Schützen[],Schützen_DB!$D$1,FALSE)))","v":""}]
[null,null,{"$f":"IF(Anmeldung[[#This Row],[Lizenz-Nr]]=\"\",\"\",IF(ISNA(VLOOKUP(Anmeldung[[#This Row],[Lizenz-Nr]],DB_Schützen[],Schützen_DB!$B$1,FALSE)),\"Teilnehmer\",VLOOKUP(Anmeldung[[#This Row],[Lizenz-Nr]],DB_Schützen[],Schützen_DB!$B$1,FALSE)))","v":""},{"$f":"IF(Anmeldung[[#This Row],[Lizenz-Nr]]=\"\",\"\",IF(ISNA(VLOOKUP(Anmeldung[[#This Row],[Lizenz-Nr]],DB_Schützen[],Schützen_DB!$C$1,FALSE)),\"nicht gefunden\",VLOOKUP(Anmeldung[[#This Row],[Lizenz-Nr]],DB_Schützen[],Schützen_DB!$C$1,FALSE)))","v":""},{"$f":"IF(Anmeldung[[#This Row],[Lizenz-Nr]]=\"\",\"\",IF(ISNA(VLOOKUP(Anmeldung[[#This Row],[Lizenz-Nr]],DB_Schützen[],Schützen_DB!$D$1,FALSE)),\"Lizenznummer prüfen oder Teilnhemer in Schützen_DB erfassen\",VLOOKUP(Anmeldung[[#This Row],[Lizenz-Nr]],DB_Schützen[],Schützen_DB!$D$1,FALSE)))","v":""}]
[null,null,{"$f":"IF(Anmeldung[[#This Row],[Lizenz-Nr]]=\"\",\"\",IF(ISNA(VLOOKUP(Anmeldung[[#This Row],[Lizenz-Nr]],DB_Schützen[],Schützen_DB!$B$1,FALSE)),\"Teilnehmer\",VLOOKUP(Anmeldung[[#This Row],[Lizenz-Nr]],DB_Schützen[],Schützen_DB!$B$1,FALSE)))","v":""},{"$f":"IF(Anmeldung[[#This Row],[Lizenz-Nr]]=\"\",\"\",IF(ISNA(VLOOKUP(Anmeldung[[#This Row],[Lizenz-Nr]],DB_Schützen[],Schützen_DB!$C$1,FALSE)),\"nicht gefunden\",VLOOKUP(Anmeldung[[#This Row],[Lizenz-Nr]],DB_Schützen[],Schützen_DB!$C$1,FALSE)))","v":""},{"$f":"IF(Anmeldung[[#This Row],[Lizenz-Nr]]=\"\",\"\",IF(ISNA(VLOOKUP(Anmeldung[[#This Row],[Lizenz-Nr]],DB_Schützen[],Schützen_DB!$D$1,FALSE)),\"Lizenznummer prüfen oder Teilnhemer in Schützen_DB erfassen\",VLOOKUP(Anmeldung[[#This Row],[Lizenz-Nr]],DB_Schützen[],Schützen_DB!$D$1,FALSE)))","v":""}]
[null,null,{"$f":"IF(Anmeldung[[#This Row],[Lizenz-Nr]]=\"\",\"\",IF(ISNA(VLOOKUP(Anmeldung[[#This Row],[Lizenz-Nr]],DB_Schützen[],Schützen_DB!$B$1,FALSE)),\"Teilnehmer\",VLOOKUP(Anmeldung[[#This Row],[Lizenz-Nr]],DB_Schützen[],Schützen_DB!$B$1,FALSE)))","v":""},{"$f":"IF(Anmeldung[[#This Row],[Lizenz-Nr]]=\"\",\"\",IF(ISNA(VLOOKUP(Anmeldung[[#This Row],[Lizenz-Nr]],DB_Schützen[],Schützen_DB!$C$1,FALSE)),\"nicht gefunden\",VLOOKUP(Anmeldung[[#This Row],[Lizenz-Nr]],DB_Schützen[],Schützen_DB!$C$1,FALSE)))","v":""},{"$f":"IF(Anmeldung[[#This Row],[Lizenz-Nr]]=\"\",\"\",IF(ISNA(VLOOKUP(Anmeldung[[#This Row],[Lizenz-Nr]],DB_Schützen[],Schützen_DB!$D$1,FALSE)),\"Lizenznummer prüfen oder Teilnhemer in Schützen_DB erfassen\",VLOOKUP(Anmeldung[[#This Row],[Lizenz-Nr]],DB_Schützen[],Schützen_DB!$D$1,FALSE)))","v":""}]
[null,null,{"$f":"IF(Anmeldung[[#This Row],[Lizenz-Nr]]=\"\",\"\",IF(ISNA(VLOOKUP(Anmeldung[[#This Row],[Lizenz-Nr]],DB_Schützen[],Schützen_DB!$B$1,FALSE)),\"Teilnehmer\",VLOOKUP(Anmeldung[[#This Row],[Lizenz-Nr]],DB_Schützen[],Schützen_DB!$B$1,FALSE)))","v":""},{"$f":"IF(Anmeldung[[#This Row],[Lizenz-Nr]]=\"\",\"\",IF(ISNA(VLOOKUP(Anmeldung[[#This Row],[Lizenz-Nr]],DB_Schützen[],Schützen_DB!$C$1,FALSE)),\"nicht gefunden\",VLOOKUP(Anmeldung[[#This Row],[Lizenz-Nr]],DB_Schützen[],Schützen_DB!$C$1,FALSE)))","v":""},{"$f":"IF(Anmeldung[[#This Row],[Lizenz-Nr]]=\"\",\"\",IF(ISNA(VLOOKUP(Anmeldung[[#This Row],[Lizenz-Nr]],DB_Schützen[],Schützen_DB!$D$1,FALSE)),\"Lizenznummer prüfen oder Teilnhemer in Schützen_DB erfassen\",VLOOKUP(Anmeldung[[#This Row],[Lizenz-Nr]],DB_Schützen[],Schützen_DB!$D$1,FALSE)))","v":""}]
[null,null,{"$f":"IF(Anmeldung[[#This Row],[Lizenz-Nr]]=\"\",\"\",IF(ISNA(VLOOKUP(Anmeldung[[#This Row],[Lizenz-Nr]],DB_Schützen[],Schützen_DB!$B$1,FALSE)),\"Teilnehmer\",VLOOKUP(Anmeldung[[#This Row],[Lizenz-Nr]],DB_Schützen[],Schützen_DB!$B$1,FALSE)))","v":""},{"$f":"IF(Anmeldung[[#This Row],[Lizenz-Nr]]=\"\",\"\",IF(ISNA(VLOOKUP(Anmeldung[[#This Row],[Lizenz-Nr]],DB_Schützen[],Schützen_DB!$C$1,FALSE)),\"nicht gefunden\",VLOOKUP(Anmeldung[[#This Row],[Lizenz-Nr]],DB_Schützen[],Schützen_DB!$C$1,FALSE)))","v":""},{"$f":"IF(Anmeldung[[#This Row],[Lizenz-Nr]]=\"\",\"\",IF(ISNA(VLOOKUP(Anmeldung[[#This Row],[Lizenz-Nr]],DB_Schützen[],Schützen_DB!$D$1,FALSE)),\"Lizenznummer prüfen oder Teilnhemer in Schützen_DB erfassen\",VLOOKUP(Anmeldung[[#This Row],[Lizenz-Nr]],DB_Schützen[],Schützen_DB!$D$1,FALSE)))","v":""}]
[null,null,{"$f":"IF(Anmeldung[[#This Row],[Lizenz-Nr]]=\"\",\"\",IF(ISNA(VLOOKUP(Anmeldung[[#This Row],[Lizenz-Nr]],DB_Schützen[],Schützen_DB!$B$1,FALSE)),\"Teilnehmer\",VLOOKUP(Anmeldung[[#This Row],[Lizenz-Nr]],DB_Schützen[],Schützen_DB!$B$1,FALSE)))","v":""},{"$f":"IF(Anmeldung[[#This Row],[Lizenz-Nr]]=\"\",\"\",IF(ISNA(VLOOKUP(Anmeldung[[#This Row],[Lizenz-Nr]],DB_Schützen[],Schützen_DB!$C$1,FALSE)),\"nicht gefunden\",VLOOKUP(Anmeldung[[#This Row],[Lizenz-Nr]],DB_Schützen[],Schützen_DB!$C$1,FALSE)))","v":""},{"$f":"IF(Anmeldung[[#This Row],[Lizenz-Nr]]=\"\",\"\",IF(ISNA(VLOOKUP(Anmeldung[[#This Row],[Lizenz-Nr]],DB_Schützen[],Schützen_DB!$D$1,FALSE)),\"Lizenznummer prüfen oder Teilnhemer in Schützen_DB erfassen\",VLOOKUP(Anmeldung[[#This Row],[Lizenz-Nr]],DB_Schützen[],Schützen_DB!$D$1,FALSE)))","v":""}]
[null,null,{"$f":"IF(Anmeldung[[#This Row],[Lizenz-Nr]]=\"\",\"\",IF(ISNA(VLOOKUP(Anmeldung[[#This Row],[Lizenz-Nr]],DB_Schützen[],Schützen_DB!$B$1,FALSE)),\"Teilnehmer\",VLOOKUP(Anmeldung[[#This Row],[Lizenz-Nr]],DB_Schützen[],Schützen_DB!$B$1,FALSE)))","v":""},{"$f":"IF(Anmeldung[[#This Row],[Lizenz-Nr]]=\"\",\"\",IF(ISNA(VLOOKUP(Anmeldung[[#This Row],[Lizenz-Nr]],DB_Schützen[],Schützen_DB!$C$1,FALSE)),\"nicht gefunden\",VLOOKUP(Anmeldung[[#This Row],[Lizenz-Nr]],DB_Schützen[],Schützen_DB!$C$1,FALSE)))","v":""},{"$f":"IF(Anmeldung[[#This Row],[Lizenz-Nr]]=\"\",\"\",IF(ISNA(VLOOKUP(Anmeldung[[#This Row],[Lizenz-Nr]],DB_Schützen[],Schützen_DB!$D$1,FALSE)),\"Lizenznummer prüfen oder Teilnhemer in Schützen_DB erfassen\",VLOOKUP(Anmeldung[[#This Row],[Lizenz-Nr]],DB_Schützen[],Schützen_DB!$D$1,FALSE)))","v":""}]
[null,null,{"$f":"IF(Anmeldung[[#This Row],[Lizenz-Nr]]=\"\",\"\",IF(ISNA(VLOOKUP(Anmeldung[[#This Row],[Lizenz-Nr]],DB_Schützen[],Schützen_DB!$B$1,FALSE)),\"Teilnehmer\",VLOOKUP(Anmeldung[[#This Row],[Lizenz-Nr]],DB_Schützen[],Schützen_DB!$B$1,FALSE)))","v":""},{"$f":"IF(Anmeldung[[#This Row],[Lizenz-Nr]]=\"\",\"\",IF(ISNA(VLOOKUP(Anmeldung[[#This Row],[Lizenz-Nr]],DB_Schützen[],Schützen_DB!$C$1,FALSE)),\"nicht gefunden\",VLOOKUP(Anmeldung[[#This Row],[Lizenz-Nr]],DB_Schützen[],Schützen_DB!$C$1,FALSE)))","v":""},{"$f":"IF(Anmeldung[[#This Row],[Lizenz-Nr]]=\"\",\"\",IF(ISNA(VLOOKUP(Anmeldung[[#This Row],[Lizenz-Nr]],DB_Schützen[],Schützen_DB!$D$1,FALSE)),\"Lizenznummer prüfen oder Teilnhemer in Schützen_DB erfassen\",VLOOKUP(Anmeldung[[#This Row],[Lizenz-Nr]],DB_Schützen[],Schützen_DB!$D$1,FALSE)))","v":""}]
[null,null,{"$f":"IF(Anmeldung[[#This Row],[Lizenz-Nr]]=\"\",\"\",IF(ISNA(VLOOKUP(Anmeldung[[#This Row],[Lizenz-Nr]],DB_Schützen[],Schützen_DB!$B$1,FALSE)),\"Teilnehmer\",VLOOKUP(Anmeldung[[#This Row],[Lizenz-Nr]],DB_Schützen[],Schützen_DB!$B$1,FALSE)))","v":""},{"$f":"IF(Anmeldung[[#This Row],[Lizenz-Nr]]=\"\",\"\",IF(ISNA(VLOOKUP(Anmeldung[[#This Row],[Lizenz-Nr]],DB_Schützen[],Schützen_DB!$C$1,FALSE)),\"nicht gefunden\",VLOOKUP(Anmeldung[[#This Row],[Lizenz-Nr]],DB_Schützen[],Schützen_DB!$C$1,FALSE)))","v":""},{"$f":"IF(Anmeldung[[#This Row],[Lizenz-Nr]]=\"\",\"\",IF(ISNA(VLOOKUP(Anmeldung[[#This Row],[Lizenz-Nr]],DB_Schützen[],Schützen_DB!$D$1,FALSE)),\"Lizenznummer prüfen oder Teilnhemer in Schützen_DB erfassen\",VLOOKUP(Anmeldung[[#This Row],[Lizenz-Nr]],DB_Schützen[],Schützen_DB!$D$1,FALSE)))","v":""}]
[null,null,{"$f":"IF(Anmeldung[[#This Row],[Lizenz-Nr]]=\"\",\"\",IF(ISNA(VLOOKUP(Anmeldung[[#This Row],[Lizenz-Nr]],DB_Schützen[],Schützen_DB!$B$1,FALSE)),\"Teilnehmer\",VLOOKUP(Anmeldung[[#This Row],[Lizenz-Nr]],DB_Schützen[],Schützen_DB!$B$1,FALSE)))","v":""},{"$f":"IF(Anmeldung[[#This Row],[Lizenz-Nr]]=\"\",\"\",IF(ISNA(VLOOKUP(Anmeldung[[#This Row],[Lizenz-Nr]],DB_Schützen[],Schützen_DB!$C$1,FALSE)),\"nicht gefunden\",VLOOKUP(Anmeldung[[#This Row],[Lizenz-Nr]],DB_Schützen[],Schützen_DB!$C$1,FALSE)))","v":""},{"$f":"IF(Anmeldung[[#This Row],[Lizenz-Nr]]=\"\",\"\",IF(ISNA(VLOOKUP(Anmeldung[[#This Row],[Lizenz-Nr]],DB_Schützen[],Schützen_DB!$D$1,FALSE)),\"Lizenznummer prüfen oder Teilnhemer in Schützen_DB erfassen\",VLOOKUP(Anmeldung[[#This Row],[Lizenz-Nr]],DB_Schützen[],Schützen_DB!$D$1,FALSE)))","v":""}]
[null,null,{"$f":"IF(Anmeldung[[#This Row],[Lizenz-Nr]]=\"\",\"\",IF(ISNA(VLOOKUP(Anmeldung[[#This Row],[Lizenz-Nr]],DB_Schützen[],Schützen_DB!$B$1,FALSE)),\"Teilnehmer\",VLOOKUP(Anmeldung[[#This Row],[Lizenz-Nr]],DB_Schützen[],Schützen_DB!$B$1,FALSE)))","v":""},{"$f":"IF(Anmeldung[[#This Row],[Lizenz-Nr]]=\"\",\"\",IF(ISNA(VLOOKUP(Anmeldung[[#This Row],[Lizenz-Nr]],DB_Schützen[],Schützen_DB!$C$1,FALSE)),\"nicht gefunden\",VLOOKUP(Anmeldung[[#This Row],[Lizenz-Nr]],DB_Schützen[],Schützen_DB!$C$1,FALSE)))","v":""},{"$f":"IF(Anmeldung[[#This Row],[Lizenz-Nr]]=\"\",\"\",IF(ISNA(VLOOKUP(Anmeldung[[#This Row],[Lizenz-Nr]],DB_Schützen[],Schützen_DB!$D$1,FALSE)),\"Lizenznummer prüfen oder Teilnhemer in Schützen_DB erfassen\",VLOOKUP(Anmeldung[[#This Row],[Lizenz-Nr]],DB_Schützen[],Schützen_DB!$D$1,FALSE)))","v":""}]
[null,null,{"$f":"IF(Anmeldung[[#This Row],[Lizenz-Nr]]=\"\",\"\",IF(ISNA(VLOOKUP(Anmeldung[[#This Row],[Lizenz-Nr]],DB_Schützen[],Schützen_DB!$B$1,FALSE)),\"Teilnehmer\",VLOOKUP(Anmeldung[[#This Row],[Lizenz-Nr]],DB_Schützen[],Schützen_DB!$B$1,FALSE)))","v":""},{"$f":"IF(Anmeldung[[#This Row],[Lizenz-Nr]]=\"\",\"\",IF(ISNA(VLOOKUP(Anmeldung[[#This Row],[Lizenz-Nr]],DB_Schützen[],Schützen_DB!$C$1,FALSE)),\"nicht gefunden\",VLOOKUP(Anmeldung[[#This Row],[Lizenz-Nr]],DB_Schützen[],Schützen_DB!$C$1,FALSE)))","v":""},{"$f":"IF(Anmeldung[[#This Row],[Lizenz-Nr]]=\"\",\"\",IF(ISNA(VLOOKUP(Anmeldung[[#This Row],[Lizenz-Nr]],DB_Schützen[],Schützen_DB!$D$1,FALSE)),\"Lizenznummer prüfen oder Teilnhemer in Schützen_DB erfassen\",VLOOKUP(Anmeldung[[#This Row],[Lizenz-Nr]],DB_Schützen[],Schützen_DB!$D$1,FALSE)))","v":""}]
[null,null,{"$f":"IF(Anmeldung[[#This Row],[Lizenz-Nr]]=\"\",\"\",IF(ISNA(VLOOKUP(Anmeldung[[#This Row],[Lizenz-Nr]],DB_Schützen[],Schützen_DB!$B$1,FALSE)),\"Teilnehmer\",VLOOKUP(Anmeldung[[#This Row],[Lizenz-Nr]],DB_Schützen[],Schützen_DB!$B$1,FALSE)))","v":""},{"$f":"IF(Anmeldung[[#This Row],[Lizenz-Nr]]=\"\",\"\",IF(ISNA(VLOOKUP(Anmeldung[[#This Row],[Lizenz-Nr]],DB_Schützen[],Schützen_DB!$C$1,FALSE)),\"nicht gefunden\",VLOOKUP(Anmeldung[[#This Row],[Lizenz-Nr]],DB_Schützen[],Schützen_DB!$C$1,FALSE)))","v":""},{"$f":"IF(Anmeldung[[#This Row],[Lizenz-Nr]]=\"\",\"\",IF(ISNA(VLOOKUP(Anmeldung[[#This Row],[Lizenz-Nr]],DB_Schützen[],Schützen_DB!$D$1,FALSE)),\"Lizenznummer prüfen oder Teilnhemer in Schützen_DB erfassen\",VLOOKUP(Anmeldung[[#This Row],[Lizenz-Nr]],DB_Schützen[],Schützen_DB!$D$1,FALSE)))","v":""}]
[null,null,{"$f":"IF(Anmeldung[[#This Row],[Lizenz-Nr]]=\"\",\"\",IF(ISNA(VLOOKUP(Anmeldung[[#This Row],[Lizenz-Nr]],DB_Schützen[],Schützen_DB!$B$1,FALSE)),\"Teilnehmer\",VLOOKUP(Anmeldung[[#This Row],[Lizenz-Nr]],DB_Schützen[],Schützen_DB!$B$1,FALSE)))","v":""},{"$f":"IF(Anmeldung[[#This Row],[Lizenz-Nr]]=\"\",\"\",IF(ISNA(VLOOKUP(Anmeldung[[#This Row],[Lizenz-Nr]],DB_Schützen[],Schützen_DB!$C$1,FALSE)),\"nicht gefunden\",VLOOKUP(Anmeldung[[#This Row],[Lizenz-Nr]],DB_Schützen[],Schützen_DB!$C$1,FALSE)))","v":""},{"$f":"IF(Anmeldung[[#This Row],[Lizenz-Nr]]=\"\",\"\",IF(ISNA(VLOOKUP(Anmeldung[[#This Row],[Lizenz-Nr]],DB_Schützen[],Schützen_DB!$D$1,FALSE)),\"Lizenznummer prüfen oder Teilnhemer in Schützen_DB erfassen\",VLOOKUP(Anmeldung[[#This Row],[Lizenz-Nr]],DB_Schützen[],Schützen_DB!$D$1,FALSE)))","v":""}]
{"$rows_left_out":21}
{"sheet":"Schützen_DB","index":2,"n_rows":359,"n_cols":6,"rows_kept":359}
[{"$f":"COLUMN()","v":1},{"$f":"COLUMN()","v":2},{"$f":"COLUMN()","v":3},{"$f":"COLUMN()","v":4},{"$f":"COLUMN()","v":5},{"$f":"COLUMN()","v":6}]
["Lizenz","Name","Vorname","JG","Verein","Zusammengefasst"]
[30788,"Aebischer","Mario",1988,"Teufen Standschützen",{"$f":"CONCATENATE(B3,\" \",C3,\" \",D3)","v":"Aebischer Mario 1988"}]
[10223,"Alder","Johann",2006,"Herisau Schützengesellschaft Säge",{"$f":"CONCATENATE(B4,\" \",C4,\" \",D4)","v":"Alder Johann 2006"}]
[177601,"Allenspach","Michael",1981,"Heiden Feldschützen","Allenspach Michael 1981"]
[825081,"Allenspach","Fabian",2000,"Herisau Schützengesellschaft Säge","Allenspach Fabian 2000"]
[183736,"Ammann","Hubert",1962,"Waldstatt Schützengesellschaft","Ammann Hubert 1962"]
[26262,"Angulo","Jaron",2009,"Herisau Schützenverein","Angulo Jaron 2009"]
[10754,"Aydemir","Sarp",2007,"Teufen Standschützen","Aydemir Sarp 2007"]
[105540,"Bänziger","René",1961,"Herisau Schützenverein","Bänziger René 1961"]
[100163,"Bänziger","Ulrich",1958,"Bühler Feldschützengesellschaft","Bänziger Ulrich 1958"]
[285653,"Bänziger","Lorenz",1991,"Bühler Feldschützengesellschaft","Bänziger Lorenz 1991"]
[309496,"Bänziger","Nadine",1990,"Herisau Schützenverein","Bänziger Nadine 1990"]
[332163,"Bänziger","Sandra",1992,"Herisau Schützenverein","Bänziger Sandra 1992"]
[105550,"Bichsel","Kurt",1949,"Herisau Schützenverein","Bichsel Kurt 1949"]
[22382,"Bischofberger","Till",2011,"Heiden Feldschützen","Bischofberger Till 2011"]
[206778,"Bischoff","Bruno",1944,"Heiden Feldschützen","Bischoff Bruno 1944"]
[139335,"Bleiker","Sandro",1988,"Herisau Schützengesellschaft Säge","Bleiker Sandro 1988"]
[102929,"Bleiker","Ruedi",1959,"Waldstatt Schützengesellschaft","Bleiker Ruedi 1959"]
[236085,"Bleiker","Röbi",1984,"Herisau Schützengesellschaft Säge","Bleiker Röbi 1984"]
[255010,"Bodenmann","Heinz",1988,"Gais Sportschützen","Bodenmann Heinz 1988"]
[286943,"Bollinger","Jürg",1983,"Wald AR Feldschützen","Bollinger Jürg 1983"]
[113266,"Boog","Leonz",1941,"Appenzell-Ausserrhodischer Kantonalschützenverein","Boog Leonz 1941"]
[819779,"Bösch","Aileen",2003,"Gais Sportschützen","Bösch Aileen 2003"]
[100203,"Bösch","Werner",1955,"Waldstatt Schützengesellschaft","Bösch Werner 1955"]
[948057,"Bösch","Joana",2006,"Gais Sportschützen","Bösch Joana 2006"]
[686289,"Bösch","Marco",2001,"Schwellbrunn Feldschützen","Bösch Marco 2001"]
[34975,"Brändli","Josia",1997,"Rehetobel Schützengesellschaft","Brändli Josia 1997"]
[785737,"Breitenmoser","Stefan",1996,"Gais Sportschützen","Breitenmoser Stefan 1996"]
[14427,"Breu","Raphael",1982,"Reute Feldschützen","Breu Raphael 1982"]
{"$rows_left_out":330}
{"sheet":"Dropdown","index":3,"n_rows":28,"n_cols":3,"rows_kept":28,"hidden":true}
[{"$f":"COLUMN()","v":1},{"$f":"COLUMN()","v":2}]
["Feld","Vereine","Spalte1"]
["S","Bühler FSG"]
["O","Gais SPS"]
["J","Heiden FSG"]
[null,"Herisau Säge SG"]
[null,"Herisau SV"]
[null,"Rehetobel SG"]
[null,"Reute FSG"]
[null,"Schönengrund-Wald SG"]
[null,"Schwellbrunn FSG"]
[null,"Stein-Hundwil SV"]
[null,"Teufen StS"]
[null,"Urnäsch SG"]
[null,"Wald FSG"]
[null,"Waldstatt SG"]
[null,null,"Hier Vereinsname auswählen"]
{"$rows_empty":10}
[null,"Hier Vereinsname auswählen"]