{"text_format":"3","workbook":"xlsx","n_sheets":4,"sheets":["Quali_Feld Sport","Quali_Feld Ordonnanz","Quali_Jungschützen","Schützen-Datenbank"],"not_rendered":{"images":2,"macros":1,"defined_names":2,"comments":4},"read":"whole","date_system":"1900"}

{"sheet":"Quali_Feld Sport","index":0,"n_rows":93,"n_cols":18,"rows_kept":93,"merged":[[0,2,0,6],[0,7,0,8],[0,9,0,10],[1,0,1,8]]}
[null,null,"Quali Kantonaler Meisterschütze ",{"$nulls":4},{"$f":"TODAY()","v":"2025-04-09"},null,"Meldeschluss"]
["Aktive Feld Sport",{"$nulls":8},{"$f":"\"07.09.\"","v":"07.09."},{"$f":"Jahr","v":"2025-04-09"}]
["Quali Rang","Lizenz","Name / Vorname:","Verein:","KS 1","KS 2","OMM 1 Rd.","OMM 2 Rd.","OMM 3 Rd.","EWS-A","höchstes  OMM   Resultat","Total",null,"gesamt OMM beste 2","niedrigste OMM","gesamt KS"]
[1,null,{"$f":"IF($B4=\"\",\"\",VLOOKUP($B4,DB,'Schützen-Datenbank'!$B$1,FALSE))","v":""},{"$f":"IF($B4=\"\",\"\",VLOOKUP($B4,DB,'Schützen-Datenbank'!$F$1,FALSE))","v":""},{"$nulls":6},{"$f":"MAX(G4:I4)","v":0},{"$f":"SUM(E4+F4+J4)+N4","v":0},null,{"$f":"SUM(G4:I4)-O4","v":0},{"$f":"MIN(G4:I4)","v":0},{"$f":"(SUM(E4:F4))","v":0}]
[2,null,{"$f":"IF($B5=\"\",\"\",VLOOKUP($B5,DB,'Schützen-Datenbank'!$B$1,FALSE))","v":""},{"$f":"IF(B5=\"\",\"\",VLOOKUP(B5,DB,'Schützen-Datenbank'!$F$1,FALSE))","v":""},{"$nulls":6},0,0,null,0,0,0,null,{"$f":"C90","v":"Rangierung Feld Sport:                            "}]
[3,null,{"$f":"IF($B6=\"\",\"\",VLOOKUP($B6,DB,'Schützen-Datenbank'!$B$1,FALSE))","v":""},{"$f":"IF(B6=\"\",\"\",VLOOKUP(B6,DB,'Schützen-Datenbank'!$F$1,FALSE))","v":""},{"$nulls":6},0,0,null,0,0,0,null,{"$f":"C91","v":"a) Einzelwettschiessen Kat A              "}]
[4,null,{"$f":"IF($B7=\"\",\"\",VLOOKUP($B7,DB,'Schützen-Datenbank'!$B$1,FALSE))","v":""},{"$f":"IF(B7=\"\",\"\",VLOOKUP(B7,DB,'Schützen-Datenbank'!$F$1,FALSE))","v":""},{"$nulls":6},0,0,null,0,0,0,null,{"$f":"C92","v":"b) 2 besten Kantonalstiche                "}]
[5,null,{"$f":"IF($B8=\"\",\"\",VLOOKUP($B8,DB,'Schützen-Datenbank'!$B$1,FALSE))","v":""},{"$f":"IF(B8=\"\",\"\",VLOOKUP(B8,DB,'Schützen-Datenbank'!$F$1,FALSE))","v":""},{"$nulls":6},0,0,null,0,0,0,null,{"$f":"C93","v":"c) das Total der 2 besten Runden OMM (1. bis 3. Runde) "}]
[6,null,{"$f":"IF($B9=\"\",\"\",VLOOKUP($B9,DB,'Schützen-Datenbank'!$B$1,FALSE))","v":""},{"$f":"IF(B9=\"\",\"\",VLOOKUP(B9,DB,'Schützen-Datenbank'!$F$1,FALSE))","v":""},{"$nulls":6},0,0,null,0,0,0]
[7,null,{"$f":"IF($B10=\"\",\"\",VLOOKUP($B10,DB,'Schützen-Datenbank'!$B$1,FALSE))","v":""},{"$f":"IF(B10=\"\",\"\",VLOOKUP(B10,DB,'Schützen-Datenbank'!$F$1,FALSE))","v":""},{"$nulls":6},0,0,null,0,0,0]
[8,null,{"$f":"IF($B11=\"\",\"\",VLOOKUP($B11,DB,'Schützen-Datenbank'!$B$1,FALSE))","v":""},{"$f":"IF(B11=\"\",\"\",VLOOKUP(B11,DB,'Schützen-Datenbank'!$F$1,FALSE))","v":""},{"$nulls":6},0,0,null,0,0,0]
[9,null,{"$f":"IF($B12=\"\",\"\",VLOOKUP($B12,DB,'Schützen-Datenbank'!$B$1,FALSE))","v":""},{"$f":"IF(B12=\"\",\"\",VLOOKUP(B12,DB,'Schützen-Datenbank'!$F$1,FALSE))","v":""},{"$nulls":6},0,0,null,0,0,0]
[10,null,{"$f":"IF($B13=\"\",\"\",VLOOKUP($B13,DB,'Schützen-Datenbank'!$B$1,FALSE))","v":""},{"$f":"IF(B13=\"\",\"\",VLOOKUP(B13,DB,'Schützen-Datenbank'!$F$1,FALSE))","v":""},{"$nulls":6},0,0,null,0,0,0]
[11,null,{"$f":"IF($B14=\"\",\"\",VLOOKUP($B14,DB,'Schützen-Datenbank'!$B$1,FALSE))","v":""},{"$f":"IF(B14=\"\",\"\",VLOOKUP(B14,DB,'Schützen-Datenbank'!$F$1,FALSE))","v":""},{"$nulls":6},0,0,null,0,0,0]
[12,null,{"$f":"IF($B15=\"\",\"\",VLOOKUP($B15,DB,'Schützen-Datenbank'!$B$1,FALSE))","v":""},{"$f":"IF(B15=\"\",\"\",VLOOKUP(B15,DB,'Schützen-Datenbank'!$F$1,FALSE))","v":""},{"$nulls":6},0,0,null,0,0,0]
[13,null,{"$f":"IF($B16=\"\",\"\",VLOOKUP($B16,DB,'Schützen-Datenbank'!$B$1,FALSE))","v":""},{"$f":"IF(B16=\"\",\"\",VLOOKUP(B16,DB,'Schützen-Datenbank'!$F$1,FALSE))","v":""},{"$nulls":6},0,0,null,0,0,0]
[14,null,{"$f":"IF($B17=\"\",\"\",VLOOKUP($B17,DB,'Schützen-Datenbank'!$B$1,FALSE))","v":""},{"$f":"IF(B17=\"\",\"\",VLOOKUP(B17,DB,'Schützen-Datenbank'!$F$1,FALSE))","v":""},{"$nulls":6},0,0,null,0,0,0]
[15,null,{"$f":"IF($B18=\"\",\"\",VLOOKUP($B18,DB,'Schützen-Datenbank'!$B$1,FALSE))","v":""},{"$f":"IF(B18=\"\",\"\",VLOOKUP(B18,DB,'Schützen-Datenbank'!$F$1,FALSE))","v":""},{"$nulls":6},0,0,null,0,0,0]
[16,null,{"$f":"IF($B19=\"\",\"\",VLOOKUP($B19,DB,'Schützen-Datenbank'!$B$1,FALSE))","v":""},{"$f":"IF(B19=\"\",\"\",VLOOKUP(B19,DB,'Schützen-Datenbank'!$F$1,FALSE))","v":""},{"$nulls":6},0,0,null,0,0,0]
["17 (1. Ersatz)",null,{"$f":"IF($B20=\"\",\"\",VLOOKUP($B20,DB,'Schützen-Datenbank'!$B$1,FALSE))","v":""},{"$f":"IF(B20=\"\",\"\",VLOOKUP(B20,DB,'Schützen-Datenbank'!$F$1,FALSE))","v":""},{"$nulls":6},0,0,null,0,0,0]
["18 (2. Ersatz)",null,{"$f":"IF($B21=\"\",\"\",VLOOKUP($B21,DB,'Schützen-Datenbank'!$B$1,FALSE))","v":""},{"$f":"IF(B21=\"\",\"\",VLOOKUP(B21,DB,'Schützen-Datenbank'!$F$1,FALSE))","v":""},{"$nulls":6},0,0,null,0,0,0]
["19 (3. Ersatz)",null,{"$f":"IF($B22=\"\",\"\",VLOOKUP($B22,DB,'Schützen-Datenbank'!$B$1,FALSE))","v":""},{"$f":"IF(B22=\"\",\"\",VLOOKUP(B22,DB,'Schützen-Datenbank'!$F$1,FALSE))","v":""},{"$nulls":6},0,0,null,0,0,0]
[20,null,{"$f":"IF($B23=\"\",\"\",VLOOKUP($B23,DB,'Schützen-Datenbank'!$B$1,FALSE))","v":""},{"$f":"IF(B23=\"\",\"\",VLOOKUP(B23,DB,'Schützen-Datenbank'!$F$1,FALSE))","v":""},{"$nulls":6},0,0,null,0,0,0]
[21,null,{"$f":"IF($B24=\"\",\"\",VLOOKUP($B24,DB,'Schützen-Datenbank'!$B$1,FALSE))","v":""},{"$f":"IF(B24=\"\",\"\",VLOOKUP(B24,DB,'Schützen-Datenbank'!$F$1,FALSE))","v":""},{"$nulls":6},0,0,null,0,0,0]
[22,null,{"$f":"IF($B25=\"\",\"\",VLOOKUP($B25,DB,'Schützen-Datenbank'!$B$1,FALSE))","v":""},{"$f":"IF(B25=\"\",\"\",VLOOKUP(B25,DB,'Schützen-Datenbank'!$F$1,FALSE))","v":""},{"$nulls":6},0,0,null,0,0,0]
[23,null,{"$f":"IF($B26=\"\",\"\",VLOOKUP($B26,DB,'Schützen-Datenbank'!$B$1,FALSE))","v":""},{"$f":"IF(B26=\"\",\"\",VLOOKUP(B26,DB,'Schützen-Datenbank'!$F$1,FALSE))","v":""},{"$nulls":6},0,0,null,0,0,0]
[24,null,{"$f":"IF($B27=\"\",\"\",VLOOKUP($B27,DB,'Schützen-Datenbank'!$B$1,FALSE))","v":""},{"$f":"IF(B27=\"\",\"\",VLOOKUP(B27,DB,'Schützen-Datenbank'!$F$1,FALSE))","v":""},{"$nulls":6},0,0,null,0,0,0]
[25,null,{"$f":"IF($B28=\"\",\"\",VLOOKUP($B28,DB,'Schützen-Datenbank'!$B$1,FALSE))","v":""},{"$f":"IF(B28=\"\",\"\",VLOOKUP(B28,DB,'Schützen-Datenbank'!$F$1,FALSE))","v":""},{"$nulls":6},0,0,null,0,0,0]
[26,null,{"$f":"IF($B29=\"\",\"\",VLOOKUP($B29,DB,'Schützen-Datenbank'!$B$1,FALSE))","v":""},{"$f":"IF(B29=\"\",\"\",VLOOKUP(B29,DB,'Schützen-Datenbank'!$F$1,FALSE))","v":""},{"$nulls":6},0,0,null,0,0,0]
[27,null,{"$f":"IF($B30=\"\",\"\",VLOOKUP($B30,DB,'Schützen-Datenbank'!$B$1,FALSE))","v":""},{"$f":"IF(B30=\"\",\"\",VLOOKUP(B30,DB,'Schützen-Datenbank'!$F$1,FALSE))","v":""},{"$nulls":6},0,0,null,0,0,0]
{"$rows_left_out":64}
{"sheet":"Quali_Feld Ordonnanz","index":1,"n_rows":104,"n_cols":14,"rows_kept":104,"merged":[[0,5,0,6]]}
[null,null,"Quali Kantonaler Meisterschütze ",null,null,{"$f":"TODAY()","v":"2025-04-09"},null,"Meldeschluss"]
[null,null,"                        Aktive Feld Ordonnanz",{"$nulls":4},{"$f":"'Quali_Feld Sport'!J2","v":"07.09."},{"$f":"Jahr","v":"2025-04-09"}]
["Quali Rang","Lizenz","Name / Vorname:","Verein:","KS 1","KS 2","BS","FS","EWS-D od. E","Total",null,"Höchster-KS"]
[1,null,{"$f":"IF($B4=\"\",\"\",VLOOKUP($B4,DB,'Schützen-Datenbank'!$B$1,FALSE))","v":""},{"$f":"IF($B4=\"\",\"\",VLOOKUP($B4,DB,'Schützen-Datenbank'!$F$1,FALSE))","v":""},{"$nulls":5},{"$f":"SUM(E4:I4)","v":0},null,{"$f":"SUM(E4:F4)","v":0}]
[2,null,{"$f":"IF(B5=\"\",\"\",VLOOKUP(B5,'Schützen-Datenbank'!$B$3:$C$1679,2,FALSE))","v":""},{"$f":"IF(B5=\"\",\"\",VLOOKUP(B5,DB,'Schützen-Datenbank'!$F$1,FALSE))","v":""},{"$nulls":5},0,null,0,null,{"$f":"C100","v":"Rangierung Feld Ordonnanz:"}]
[3,null,{"$f":"IF(B6=\"\",\"\",VLOOKUP(B6,'Schützen-Datenbank'!$B$3:$C$1679,2,FALSE))","v":""},{"$f":"IF(B6=\"\",\"\",VLOOKUP(B6,DB,'Schützen-Datenbank'!$F$1,FALSE))","v":""},{"$nulls":5},0,null,0,null,"a) Einzelwettschiessen Kat D oder E"]
[4,null,{"$f":"IF(B7=\"\",\"\",VLOOKUP(B7,'Schützen-Datenbank'!$B$3:$C$1679,2,FALSE))","v":""},{"$f":"IF(B7=\"\",\"\",VLOOKUP(B7,DB,'Schützen-Datenbank'!$F$1,FALSE))","v":""},{"$nulls":5},0,null,0,null,"b) das total der 2 besten Kantonalstiche Kat. D oder E"]
[5,null,{"$f":"IF(B8=\"\",\"\",VLOOKUP(B8,'Schützen-Datenbank'!$B$3:$C$1679,2,FALSE))","v":""},{"$f":"IF(B8=\"\",\"\",VLOOKUP(B8,DB,'Schützen-Datenbank'!$F$1,FALSE))","v":""},{"$nulls":5},0,null,0,null,"c) Bundesprogramm"]
[6,null,{"$f":"IF(B9=\"\",\"\",VLOOKUP(B9,'Schützen-Datenbank'!$B$3:$C$1679,2,FALSE))","v":""},{"$f":"IF(B9=\"\",\"\",VLOOKUP(B9,DB,'Schützen-Datenbank'!$F$1,FALSE))","v":""},{"$nulls":5},0,null,0,null,"d) Feldschiessen"]
[7,null,{"$f":"IF(B10=\"\",\"\",VLOOKUP(B10,'Schützen-Datenbank'!$B$3:$C$1679,2,FALSE))","v":""},{"$f":"IF(B10=\"\",\"\",VLOOKUP(B10,DB,'Schützen-Datenbank'!$F$1,FALSE))","v":""},{"$nulls":5},0,null,0]
[8,null,{"$f":"IF(B11=\"\",\"\",VLOOKUP(B11,'Schützen-Datenbank'!$B$3:$C$1679,2,FALSE))","v":""},{"$f":"IF(B11=\"\",\"\",VLOOKUP(B11,DB,'Schützen-Datenbank'!$F$1,FALSE))","v":""},{"$nulls":5},0,null,0]
[9,null,{"$f":"IF(B12=\"\",\"\",VLOOKUP(B12,'Schützen-Datenbank'!$B$3:$C$1679,2,FALSE))","v":""},{"$f":"IF(B12=\"\",\"\",VLOOKUP(B12,DB,'Schützen-Datenbank'!$F$1,FALSE))","v":""},{"$nulls":5},0,null,0]
[10,null,{"$f":"IF(B13=\"\",\"\",VLOOKUP(B13,'Schützen-Datenbank'!$B$3:$C$1679,2,FALSE))","v":""},{"$f":"IF(B13=\"\",\"\",VLOOKUP(B13,DB,'Schützen-Datenbank'!$F$1,FALSE))","v":""},{"$nulls":5},0,null,0]
[11,null,{"$f":"IF(B14=\"\",\"\",VLOOKUP(B14,'Schützen-Datenbank'!$B$3:$C$1679,2,FALSE))","v":""},{"$f":"IF(B14=\"\",\"\",VLOOKUP(B14,DB,'Schützen-Datenbank'!$F$1,FALSE))","v":""},{"$nulls":5},0,null,0]
[12,null,{"$f":"IF(B15=\"\",\"\",VLOOKUP(B15,'Schützen-Datenbank'!$B$3:$C$1679,2,FALSE))","v":""},{"$f":"IF(B15=\"\",\"\",VLOOKUP(B15,DB,'Schützen-Datenbank'!$F$1,FALSE))","v":""},{"$nulls":5},0,null,0]
[13,null,{"$f":"IF(B16=\"\",\"\",VLOOKUP(B16,'Schützen-Datenbank'!$B$3:$C$1679,2,FALSE))","v":""},{"$f":"IF(B16=\"\",\"\",VLOOKUP(B16,DB,'Schützen-Datenbank'!$F$1,FALSE))","v":""},{"$nulls":5},0,null,0]
[14,null,{"$f":"IF(B17=\"\",\"\",VLOOKUP(B17,'Schützen-Datenbank'!$B$3:$C$1679,2,FALSE))","v":""},{"$f":"IF(B17=\"\",\"\",VLOOKUP(B17,DB,'Schützen-Datenbank'!$F$1,FALSE))","v":""},{"$nulls":5},0,null,0]
[15,null,{"$f":"IF(B18=\"\",\"\",VLOOKUP(B18,'Schützen-Datenbank'!$B$3:$C$1679,2,FALSE))","v":""},{"$f":"IF(B18=\"\",\"\",VLOOKUP(B18,DB,'Schützen-Datenbank'!$F$1,FALSE))","v":""},{"$nulls":5},0,null,0]
[16,null,{"$f":"IF(B19=\"\",\"\",VLOOKUP(B19,'Schützen-Datenbank'!$B$3:$C$1679,2,FALSE))","v":""},{"$f":"IF(B19=\"\",\"\",VLOOKUP(B19,DB,'Schützen-Datenbank'!$F$1,FALSE))","v":""},{"$nulls":5},0,null,0]
[17,null,{"$f":"IF(B20=\"\",\"\",VLOOKUP(B20,'Schützen-Datenbank'!$B$3:$C$1679,2,FALSE))","v":""},{"$f":"IF(B20=\"\",\"\",VLOOKUP(B20,DB,'Schützen-Datenbank'!$F$1,FALSE))","v":""},{"$nulls":5},0,null,0]
[18,null,{"$f":"IF(B21=\"\",\"\",VLOOKUP(B21,'Schützen-Datenbank'!$B$3:$C$1679,2,FALSE))","v":""},{"$f":"IF(B21=\"\",\"\",VLOOKUP(B21,DB,'Schützen-Datenbank'!$F$1,FALSE))","v":""},{"$nulls":5},0,null,0]
[19,null,{"$f":"IF(B22=\"\",\"\",VLOOKUP(B22,'Schützen-Datenbank'!$B$3:$C$1679,2,FALSE))","v":""},{"$f":"IF(B22=\"\",\"\",VLOOKUP(B22,DB,'Schützen-Datenbank'!$F$1,FALSE))","v":""},{"$nulls":5},0,null,0]
[20,null,{"$f":"IF(B23=\"\",\"\",VLOOKUP(B23,'Schützen-Datenbank'!$B$3:$C$1679,2,FALSE))","v":""},{"$f":"IF(B23=\"\",\"\",VLOOKUP(B23,DB,'Schützen-Datenbank'!$F$1,FALSE))","v":""},{"$nulls":5},0,null,0]
[21,null,{"$f":"IF(B24=\"\",\"\",VLOOKUP(B24,'Schützen-Datenbank'!$B$3:$C$1679,2,FALSE))","v":""},{"$f":"IF(B24=\"\",\"\",VLOOKUP(B24,DB,'Schützen-Datenbank'!$F$1,FALSE))","v":""},{"$nulls":5},0,null,0]
[22,null,{"$f":"IF(B25=\"\",\"\",VLOOKUP(B25,'Schützen-Datenbank'!$B$3:$C$1679,2,FALSE))","v":""},{"$f":"IF(B25=\"\",\"\",VLOOKUP(B25,DB,'Schützen-Datenbank'!$F$1,FALSE))","v":""},{"$nulls":5},0,null,0]
[23,null,{"$f":"IF(B26=\"\",\"\",VLOOKUP(B26,'Schützen-Datenbank'!$B$3:$C$1679,2,FALSE))","v":""},{"$f":"IF(B26=\"\",\"\",VLOOKUP(B26,DB,'Schützen-Datenbank'!$F$1,FALSE))","v":""},{"$nulls":5},0,null,0]
[24,null,{"$f":"IF(B27=\"\",\"\",VLOOKUP(B27,'Schützen-Datenbank'!$B$3:$C$1679,2,FALSE))","v":""},{"$f":"IF(B27=\"\",\"\",VLOOKUP(B27,DB,'Schützen-Datenbank'!$F$1,FALSE))","v":""},{"$nulls":5},0,null,0]
["25 (1. Ersatz)",null,{"$f":"IF(B28=\"\",\"\",VLOOKUP(B28,'Schützen-Datenbank'!$B$3:$C$1679,2,FALSE))","v":""},{"$f":"IF(B28=\"\",\"\",VLOOKUP(B28,DB,'Schützen-Datenbank'!$F$1,FALSE))","v":""},{"$nulls":5},0,null,0]
["26 (2. Ersatz)",null,{"$f":"IF(B29=\"\",\"\",VLOOKUP(B29,'Schützen-Datenbank'!$B$3:$C$1679,2,FALSE))","v":""},{"$f":"IF(B29=\"\",\"\",VLOOKUP(B29,DB,'Schützen-Datenbank'!$F$1,FALSE))","v":""},{"$nulls":5},0,null,0]
["27 (3. Ersatz)",null,{"$f":"IF(B30=\"\",\"\",VLOOKUP(B30,'Schützen-Datenbank'!$B$3:$C$1679,2,FALSE))","v":""},{"$f":"IF(B30=\"\",\"\",VLOOKUP(B30,DB,'Schützen-Datenbank'!$F$1,FALSE))","v":""},{"$nulls":5},0,null,0]
{"$rows_left_out":75}
{"sheet":"Quali_Jungschützen","index":2,"n_rows":98,"n_cols":10,"rows_kept":98,"hidden":true,"merged":[[0,2,0,6],[0,7,0,8],[0,9,0,10],[1,0,1,7],[1,9,1,10]]}
[null,null,"Quali Kantonaler Meisterschütze ",{"$nulls":4},{"$f":"TODAY()","v":"2025-04-09"},null,"Meldeschluss"]
["               Jungschützen",{"$nulls":8},{"$f":"'Quali_Feld Sport'!J2","v":"07.09."}]
["Quali Rang","Lizenz","Name / Vorname:","Verein:","JS Wett","FS","BS ","JS-Stich","Total"]
[1,null,{"$f":"IF(B4=\"\",\"\",VLOOKUP(B4,'Schützen-Datenbank'!$B$3:$C$1679,2,FALSE))","v":""},{"$f":"IF(B4=\"\",\"\",VLOOKUP(B4,'Schützen-Datenbank'!$B$360:$G$1828,6,FALSE))","v":""},{"$nulls":4},{"$f":"SUM(E4:H4)","v":0}]
[2,null,{"$f":"IF(B5=\"\",\"\",VLOOKUP(B5,'Schützen-Datenbank'!$B$3:$C$1679,2,FALSE))","v":""},{"$f":"IF(B5=\"\",\"\",VLOOKUP(B5,'Schützen-Datenbank'!$B$360:$G$1828,6,FALSE))","v":""},{"$nulls":4},0]
[3,null,{"$f":"IF(B6=\"\",\"\",VLOOKUP(B6,'Schützen-Datenbank'!$B$3:$C$1679,2,FALSE))","v":""},{"$f":"IF(B6=\"\",\"\",VLOOKUP(B6,'Schützen-Datenbank'!$B$360:$G$1828,6,FALSE))","v":""},{"$nulls":4},0]
[4,null,{"$f":"IF(B7=\"\",\"\",VLOOKUP(B7,'Schützen-Datenbank'!$B$3:$C$1679,2,FALSE))","v":""},{"$f":"IF(B7=\"\",\"\",VLOOKUP(B7,'Schützen-Datenbank'!$B$360:$G$1828,6,FALSE))","v":""},{"$nulls":4},0]
[5,null,{"$f":"IF(B8=\"\",\"\",VLOOKUP(B8,'Schützen-Datenbank'!$B$3:$C$1679,2,FALSE))","v":""},{"$f":"IF(B8=\"\",\"\",VLOOKUP(B8,'Schützen-Datenbank'!$B$360:$G$1828,6,FALSE))","v":""},{"$nulls":4},0]
[6,null,{"$f":"IF(B9=\"\",\"\",VLOOKUP(B9,'Schützen-Datenbank'!$B$3:$C$1679,2,FALSE))","v":""},{"$f":"IF(B9=\"\",\"\",VLOOKUP(B9,'Schützen-Datenbank'!$B$360:$G$1828,6,FALSE))","v":""},{"$nulls":4},0]
[7,null,{"$f":"IF(B10=\"\",\"\",VLOOKUP(B10,'Schützen-Datenbank'!$B$3:$C$1679,2,FALSE))","v":""},{"$f":"IF(B10=\"\",\"\",VLOOKUP(B10,'Schützen-Datenbank'!$B$360:$G$1828,6,FALSE))","v":""},{"$nulls":4},0]
[8,null,{"$f":"IF(B11=\"\",\"\",VLOOKUP(B11,'Schützen-Datenbank'!$B$3:$C$1679,2,FALSE))","v":""},{"$f":"IF(B11=\"\",\"\",VLOOKUP(B11,'Schützen-Datenbank'!$B$360:$G$1828,6,FALSE))","v":""},{"$nulls":4},0]
[9,null,{"$f":"IF(B12=\"\",\"\",VLOOKUP(B12,'Schützen-Datenbank'!$B$3:$C$1679,2,FALSE))","v":""},{"$f":"IF(B12=\"\",\"\",VLOOKUP(B12,'Schützen-Datenbank'!$B$360:$G$1828,6,FALSE))","v":""},{"$nulls":4},0]
[10,null,{"$f":"IF(B13=\"\",\"\",VLOOKUP(B13,'Schützen-Datenbank'!$B$3:$C$1679,2,FALSE))","v":""},{"$f":"IF(B13=\"\",\"\",VLOOKUP(B13,'Schützen-Datenbank'!$B$360:$G$1828,6,FALSE))","v":""},{"$nulls":4},0]
[11,null,{"$f":"IF(B14=\"\",\"\",VLOOKUP(B14,'Schützen-Datenbank'!$B$3:$C$1679,2,FALSE))","v":""},{"$f":"IF(B14=\"\",\"\",VLOOKUP(B14,'Schützen-Datenbank'!$B$360:$G$1828,6,FALSE))","v":""},{"$nulls":4},0]
[12,null,{"$f":"IF(B15=\"\",\"\",VLOOKUP(B15,'Schützen-Datenbank'!$B$3:$C$1679,2,FALSE))","v":""},{"$f":"IF(B15=\"\",\"\",VLOOKUP(B15,'Schützen-Datenbank'!$B$360:$G$1828,6,FALSE))","v":""},{"$nulls":4},0]
[13,null,{"$f":"IF(B16=\"\",\"\",VLOOKUP(B16,'Schützen-Datenbank'!$B$3:$C$1679,2,FALSE))","v":""},{"$f":"IF(B16=\"\",\"\",VLOOKUP(B16,'Schützen-Datenbank'!$B$360:$G$1828,6,FALSE))","v":""},{"$nulls":4},0]
[14,null,{"$f":"IF(B17=\"\",\"\",VLOOKUP(B17,'Schützen-Datenbank'!$B$3:$C$1679,2,FALSE))","v":""},{"$f":"IF(B17=\"\",\"\",VLOOKUP(B17,'Schützen-Datenbank'!$B$360:$G$1828,6,FALSE))","v":""},{"$nulls":4},0]
[15,null,{"$f":"IF(B18=\"\",\"\",VLOOKUP(B18,'Schützen-Datenbank'!$B$3:$C$1679,2,FALSE))","v":""},{"$f":"IF(B18=\"\",\"\",VLOOKUP(B18,'Schützen-Datenbank'!$B$360:$G$1828,6,FALSE))","v":""},{"$nulls":4},0]
[16,null,{"$f":"IF(B19=\"\",\"\",VLOOKUP(B19,'Schützen-Datenbank'!$B$3:$C$1679,2,FALSE))","v":""},{"$f":"IF(B19=\"\",\"\",VLOOKUP(B19,'Schützen-Datenbank'!$B$360:$G$1828,6,FALSE))","v":""},{"$nulls":4},0]
[17,null,{"$f":"IF(B20=\"\",\"\",VLOOKUP(B20,'Schützen-Datenbank'!$B$3:$C$1679,2,FALSE))","v":""},{"$f":"IF(B20=\"\",\"\",VLOOKUP(B20,'Schützen-Datenbank'!$B$360:$G$1828,6,FALSE))","v":""},{"$nulls":4},0]
[18,null,{"$f":"IF(B21=\"\",\"\",VLOOKUP(B21,'Schützen-Datenbank'!$B$3:$C$1679,2,FALSE))","v":""},{"$f":"IF(B21=\"\",\"\",VLOOKUP(B21,'Schützen-Datenbank'!$B$360:$G$1828,6,FALSE))","v":""},{"$nulls":4},0]
[19,null,{"$f":"IF(B22=\"\",\"\",VLOOKUP(B22,'Schützen-Datenbank'!$B$3:$C$1679,2,FALSE))","v":""},{"$f":"IF(B22=\"\",\"\",VLOOKUP(B22,'Schützen-Datenbank'!$B$360:$G$1828,6,FALSE))","v":""},{"$nulls":4},0]
[20,null,{"$f":"IF(B23=\"\",\"\",VLOOKUP(B23,'Schützen-Datenbank'!$B$3:$C$1679,2,FALSE))","v":""},{"$f":"IF(B23=\"\",\"\",VLOOKUP(B23,'Schützen-Datenbank'!$B$360:$G$1828,6,FALSE))","v":""},{"$nulls":4},0]
[21,null,{"$f":"IF(B24=\"\",\"\",VLOOKUP(B24,'Schützen-Datenbank'!$B$3:$C$1679,2,FALSE))","v":""},{"$f":"IF(B24=\"\",\"\",VLOOKUP(B24,'Schützen-Datenbank'!$B$360:$G$1828,6,FALSE))","v":""},{"$nulls":4},0]
[22,null,{"$f":"IF(B25=\"\",\"\",VLOOKUP(B25,'Schützen-Datenbank'!$B$3:$C$1679,2,FALSE))","v":""},{"$f":"IF(B25=\"\",\"\",VLOOKUP(B25,'Schützen-Datenbank'!$B$360:$G$1828,6,FALSE))","v":""},{"$nulls":4},0]
[23,null,{"$f":"IF(B26=\"\",\"\",VLOOKUP(B26,'Schützen-Datenbank'!$B$3:$C$1679,2,FALSE))","v":""},{"$f":"IF(B26=\"\",\"\",VLOOKUP(B26,'Schützen-Datenbank'!$B$360:$G$1828,6,FALSE))","v":""},{"$nulls":4},0]
[24,null,{"$f":"IF(B27=\"\",\"\",VLOOKUP(B27,'Schützen-Datenbank'!$B$3:$C$1679,2,FALSE))","v":""},{"$f":"IF(B27=\"\",\"\",VLOOKUP(B27,'Schützen-Datenbank'!$B$360:$G$1828,6,FALSE))","v":""},{"$nulls":4},0]
[25,null,{"$f":"IF(B28=\"\",\"\",VLOOKUP(B28,'Schützen-Datenbank'!$B$3:$C$1679,2,FALSE))","v":""},{"$f":"IF(B28=\"\",\"\",VLOOKUP(B28,'Schützen-Datenbank'!$B$360:$G$1828,6,FALSE))","v":""},{"$nulls":4},0]
[26,null,{"$f":"IF(B29=\"\",\"\",VLOOKUP(B29,'Schützen-Datenbank'!$B$3:$C$1679,2,FALSE))","v":""},{"$f":"IF(B29=\"\",\"\",VLOOKUP(B29,'Schützen-Datenbank'!$B$360:$G$1828,6,FALSE))","v":""},{"$nulls":4},0]
[27,null,{"$f":"IF(B30=\"\",\"\",VLOOKUP(B30,'Schützen-Datenbank'!$B$3:$C$1679,2,FALSE))","v":""},{"$f":"IF(B30=\"\",\"\",VLOOKUP(B30,'Schützen-Datenbank'!$B$360:$G$1828,6,FALSE))","v":""},{"$nulls":4},0]
{"$rows_left_out":69}
{"sheet":"Schützen-Datenbank","index":3,"n_rows":359,"n_cols":7,"rows_kept":359}
[{"$f":"COLUMN()","v":1},{"$f":"COLUMN()","v":2},{"$f":"COLUMN()","v":3},{"$f":"COLUMN()","v":4},{"$f":"COLUMN()","v":5},{"$f":"COLUMN()","v":6},{"$f":"COLUMN()","v":7}]
[null,"Lizenz","Schützen","Name","Vorname","JG","Verein"]
[null,30788,{"$f":"CONCATENATE(D3,\" \",E3,\" \",F3,)","v":"Aebischer Mario 1988"},"Aebischer","Mario",1988,"Teufen Standschützen"]
[null,10223,{"$f":"CONCATENATE(D4,\" \",E4,\" \",F4,)","v":"Alder Johann 2006"},"Alder","Johann",2006,"Herisau Schützengesellschaft Säge"]
[null,177601,"Allenspach Michael 1981","Allenspach","Michael",1981,"Heiden Feldschützen"]
[null,825081,"Allenspach Fabian 2000","Allenspach","Fabian",2000,"Herisau Schützengesellschaft Säge"]
[null,183736,"Ammann Hubert 1962","Ammann","Hubert",1962,"Waldstatt Schützengesellschaft"]
[null,26262,"Angulo Jaron 2009","Angulo","Jaron",2009,"Herisau Schützenverein"]
[null,10754,"Aydemir Sarp 2007","Aydemir","Sarp",2007,"Teufen Standschützen"]
[null,105540,"Bänziger René 1961","Bänziger","René",1961,"Herisau Schützenverein"]
[null,100163,"Bänziger Ulrich 1958","Bänziger","Ulrich",1958,"Bühler Feldschützengesellschaft"]
[null,285653,"Bänziger Lorenz 1991","Bänziger","Lorenz",1991,"Bühler Feldschützengesellschaft"]
[null,309496,"Bänziger Nadine 1990","Bänziger","Nadine",1990,"Herisau Schützenverein"]
[null,332163,"Bänziger Sandra 1992","Bänziger","Sandra",1992,"Herisau Schützenverein"]
[null,105550,"Bichsel Kurt 1949","Bichsel","Kurt",1949,"Herisau Schützenverein"]
[null,22382,"Bischofberger Till 2011","Bischofberger","Till",2011,"Heiden Feldschützen"]
[null,206778,"Bischoff Bruno 1944","Bischoff","Bruno",1944,"Heiden Feldschützen"]
[null,139335,"Bleiker Sandro 1988","Bleiker","Sandro",1988,"Herisau Schützengesellschaft Säge"]
[null,102929,"Bleiker Ruedi 1959","Bleiker","Ruedi",1959,"Waldstatt Schützengesellschaft"]
[null,236085,"Bleiker Röbi 1984","Bleiker","Röbi",1984,"Herisau Schützengesellschaft Säge"]
[null,255010,"Bodenmann Heinz 1988","Bodenmann","Heinz",1988,"Gais Sportschützen"]
[null,286943,"Bollinger Jürg 1983","Bollinger","Jürg",1983,"Wald AR Feldschützen"]
[null,113266,"Boog Leonz 1941","Boog","Leonz",1941,"Appenzell-Ausserrhodischer Kantonalschützenverein"]
[null,819779,"Bösch Aileen 2003","Bösch","Aileen",2003,"Gais Sportschützen"]
[null,100203,"Bösch Werner 1955","Bösch","Werner",1955,"Waldstatt Schützengesellschaft"]
[null,948057,"Bösch Joana 2006","Bösch","Joana",2006,"Gais Sportschützen"]
[null,686289,"Bösch Marco 2001","Bösch","Marco",2001,"Schwellbrunn Feldschützen"]
[null,34975,"Brändli Josia 1997","Brändli","Josia",1997,"Rehetobel Schützengesellschaft"]
[null,785737,"Breitenmoser Stefan 1996","Breitenmoser","Stefan",1996,"Gais Sportschützen"]
[null,14427,"Breu Raphael 1982","Breu","Raphael",1982,"Reute Feldschützen"]
{"$rows_left_out":329}